Installare Fluxion su Debian Stretch

 

Installare Fluxion su Debian Stretch

Installare Fluxion su Debian Stretch

Fluxion al momento è uno dei migliori tools per il cracking wifi, con password WPA/WPA2 senza ricorrere ed  attacchi bruteforce o dizionario. Per installare Fluxion su Debian Stretch, bisogna risolvere alcune dipendenze, sopratutto quella di pyrit, non più presente nei repository Debian.

Installazione dipendenze:

$ sudo apt install -y aircrack-ng reaver rfkill macchanger isc-dhcp-server curl hostapd lighttpd nmap mdk3 php-cgi python-scapy python-pip forensics-extra unzip xterm libpcap-dev libpcap0.8-dev
$ sudo pip install psycopg2
$ sudo pip install libsass
$ sudo pip install scapy

Installazione pyrit:

git clone https://github.com/JPaulMora/Pyrit.git
cd Pyrit/
python setup.py clean
python setup.py build
sudo python setup.py install

Installazione Fluxion:

git clone https://github.com/wi-fi-analyzer/fluxion
cd fluxion/
sudo ./fluxion.sh

Installare Fluxion su Debian Stretch

Installare Fluxion su Debian Stretch

per l'utilizzo nella prossima guida metterò gli screenshots di un attacco ad una rete wifi con password wpa2. La rete sotto attacco sarà la mia.

enjoy 😉

 

Post simili (quasi):

9 pensieri riguardo “Installare Fluxion su Debian Stretch”

  1. Google Chrome 52.0.2743.82 Google Chrome 52.0.2743.82 GNU/Linux x64 GNU/Linux x64
    Mozilla/5.0 (X11; Linux x86_64) AppleWebKit/537.36 (KHTML, like Gecko) Chrome/52.0.2743.82 Safari/537.36

    anche il pacchetto  php5-cgi non è presente in stretch. infatti rilascia questo errore:

    "Il pacchetto php5-cgi non ha versioni disponibili, ma è nominato da un altro
    pacchetto. Questo potrebbe indicare che il pacchetto è mancante, obsoleto
    oppure è disponibile solo all'interno di un'altra sorgente"

  2. Safari 11.0 Safari 11.0 iPhone iOS 11.1.1 iPhone iOS 11.1.1
    Mozilla/5.0 (iPhone; CPU iPhone OS 11_1_1 like Mac OS X) AppleWebKit/604.3.5 (KHTML, like Gecko) Version/11.0 Mobile/15B150 Safari/604.1

    allora prova php-cgi, ho fatto 2 installazioni una su Debian Stretch e l’altra su Raspbian Stretch, può darsi che ho invertito qualcosa 😉

  3. Firefox 50.0 Firefox 50.0 Mac OS X  10.11 Mac OS X 10.11
    Mozilla/5.0 (Macintosh; Intel Mac OS X 10.11; rv:50.0) Gecko/20100101 Firefox/50.0

    python setup.py build
    running build
    running build_py
    creating build
    creating build/lib.linux-x86_64-2.7
    copying pyrit_cli.py -> build/lib.linux-x86_64-2.7
    creating build/lib.linux-x86_64-2.7/cpyrit
    copying cpyrit/__init__.py -> build/lib.linux-x86_64-2.7/cpyrit
    copying cpyrit/cpyrit.py -> build/lib.linux-x86_64-2.7/cpyrit
    copying cpyrit/util.py -> build/lib.linux-x86_64-2.7/cpyrit
    copying cpyrit/pckttools.py -> build/lib.linux-x86_64-2.7/cpyrit
    copying cpyrit/config.py -> build/lib.linux-x86_64-2.7/cpyrit
    copying cpyrit/network.py -> build/lib.linux-x86_64-2.7/cpyrit
    copying cpyrit/storage.py -> build/lib.linux-x86_64-2.7/cpyrit
    running build_ext
    building 'cpyrit._cpyrit_cpu' extension
    creating build/temp.linux-x86_64-2.7
    creating build/temp.linux-x86_64-2.7/cpyrit
    x86_64-linux-gnu-gcc -pthread -DNDEBUG -g -fwrapv -O2 -Wall -Wstrict-prototypes -fno-strict-aliasing -Wdate-time -D_FORTIFY_SOURCE=2 -g -fdebug-prefix-map=/build/python2.7-HVkOs2/python2.7-2.7.13=. -fstack-protector-strong -Wformat -Werror=format-security -fPIC -I/usr/include/python2.7 -c cpyrit/_cpyrit_cpu.c -o build/temp.linux-x86_64-2.7/cpyrit/_cpyrit_cpu.o -Wall -fno-strict-aliasing -DVERSION="0.5.1" -maes -mpclmul
    cpyrit/_cpyrit_cpu.c:39:18: fatal error: zlib.h: File o directory non esistente
     #include <zlib.h>
                      ^
    compilation terminated.
    Failed to build; Compiling without AES-NI
    building 'cpyrit._cpyrit_cpu' extension
    x86_64-linux-gnu-gcc -pthread -DNDEBUG -g -fwrapv -O2 -Wall -Wstrict-prototypes -fno-strict-aliasing -Wdate-time -D_FORTIFY_SOURCE=2 -g -fdebug-prefix-map=/build/python2.7-HVkOs2/python2.7-2.7.13=. -fstack-protector-strong -Wformat -Werror=format-security -fPIC -I/usr/include/python2.7 -c cpyrit/_cpyrit_cpu.c -o build/temp.linux-x86_64-2.7/cpyrit/_cpyrit_cpu.o -Wall -fno-strict-aliasing -DVERSION="0.5.1"
    cpyrit/_cpyrit_cpu.c:39:18: fatal error: zlib.h: File o directory non esistente
     #include <zlib.h>
                      ^
    compilation terminated.
    error: command 'x86_64-linux-gnu-gcc' failed with exit status 1
     

  4. Firefox 52.0 Firefox 52.0 GNU/Linux x64 GNU/Linux x64
    Mozilla/5.0 (X11; Linux x86_64; rv:52.0) Gecko/20100101 Firefox/52.0

    deve funzionare ho appena fatto un test:

    sudo apt install devscripts

  5. Safari 9.1.1 Safari 9.1.1 Mac OS X  10.10.5 Mac OS X 10.10.5
    Mozilla/5.0 (Macintosh; Intel Mac OS X 10_10_5) AppleWebKit/601.6.17 (KHTML, like Gecko) Version/9.1.1 Safari/601.6.17

    python setup.py build
    running build
    running build_py
    running build_ext
    building 'cpyrit._cpyrit_cpu' extension
    creating build/temp.linux-x86_64-2.7
    creating build/temp.linux-x86_64-2.7/cpyrit
    x86_64-linux-gnu-gcc -pthread -DNDEBUG -g -fwrapv -O2 -Wall -Wstrict-prototypes -fno-strict-aliasing -Wdate-time -D_FORTIFY_SOURCE=2 -g -fdebug-prefix-map=/build/python2.7-HVkOs2/python2.7-2.7.13=. -fstack-protector-strong -Wformat -Werror=format-security -fPIC -I/usr/include/python2.7 -c cpyrit/_cpyrit_cpu.c -o build/temp.linux-x86_64-2.7/cpyrit/_cpyrit_cpu.o -Wall -fno-strict-aliasing -DVERSION="0.5.1" -maes -mpclmul
    cpyrit/_cpyrit_cpu.c:39:18: fatal error: zlib.h: File o directory non esistente
     #include <zlib.h>
                      ^
    compilation terminated.
    Failed to build; Compiling without AES-NI
    building 'cpyrit._cpyrit_cpu' extension
    x86_64-linux-gnu-gcc -pthread -DNDEBUG -g -fwrapv -O2 -Wall -Wstrict-prototypes -fno-strict-aliasing -Wdate-time -D_FORTIFY_SOURCE=2 -g -fdebug-prefix-map=/build/python2.7-HVkOs2/python2.7-2.7.13=. -fstack-protector-strong -Wformat -Werror=format-security -fPIC -I/usr/include/python2.7 -c cpyrit/_cpyrit_cpu.c -o build/temp.linux-x86_64-2.7/cpyrit/_cpyrit_cpu.o -Wall -fno-strict-aliasing -DVERSION="0.5.1"
    cpyrit/_cpyrit_cpu.c:39:18: fatal error: zlib.h: File o directory non esistente
     #include <zlib.h>
                      ^
    compilation terminated.
    error: command 'x86_64-linux-gnu-gcc' failed with exit status 1

     

  6. Firefox 57.0 Firefox 57.0 GNU/Linux x64 GNU/Linux x64
    Mozilla/5.0 (X11; Linux x86_64; rv:57.0) Gecko/20100101 Firefox/57.0

    apt install zlib1g-dev

  7. rekonq rekonq GNU/Linux GNU/Linux
    Mozilla/5.0 (X11; Linux i686) AppleWebKit/537.21 (KHTML, like Gecko) rekonq/2.4.2 Safari/537.21

    [scusami se ti stresso e grazie per la pazienza!]

    python setup.py build
    running build
    running build_py
    running build_ext
    building 'cpyrit._cpyrit_cpu' extension
    x86_64-linux-gnu-gcc -pthread -DNDEBUG -g -fwrapv -O2 -Wall -Wstrict-prototypes -fno-strict-aliasing -Wdate-time -D_FORTIFY_SOURCE=2 -g -fdebug-prefix-map=/build/python2.7-HVkOs2/python2.7-2.7.13=. -fstack-protector-strong -Wformat -Werror=format-security -fPIC -I/usr/include/python2.7 -c cpyrit/_cpyrit_cpu.c -o build/temp.linux-x86_64-2.7/cpyrit/_cpyrit_cpu.o -Wall -fno-strict-aliasing -DVERSION="0.5.1" -maes -mpclmul
    cpyrit/_cpyrit_cpu.c:40:18: fatal error: pcap.h: File o directory non esistente
     #include <pcap.h>
                      ^
    compilation terminated.
    Failed to build; Compiling without AES-NI
    building 'cpyrit._cpyrit_cpu' extension
    x86_64-linux-gnu-gcc -pthread -DNDEBUG -g -fwrapv -O2 -Wall -Wstrict-prototypes -fno-strict-aliasing -Wdate-time -D_FORTIFY_SOURCE=2 -g -fdebug-prefix-map=/build/python2.7-HVkOs2/python2.7-2.7.13=. -fstack-protector-strong -Wformat -Werror=format-security -fPIC -I/usr/include/python2.7 -c cpyrit/_cpyrit_cpu.c -o build/temp.linux-x86_64-2.7/cpyrit/_cpyrit_cpu.o -Wall -fno-strict-aliasing -DVERSION="0.5.1"
    cpyrit/_cpyrit_cpu.c:40:18: fatal error: pcap.h: File o directory non esistente
     #include <pcap.h>
                      ^
    compilation terminated.
    error: command 'x86_64-linux-gnu-gcc' failed with exit status 1

     

  8. Firefox 57.0 Firefox 57.0 GNU/Linux x64 GNU/Linux x64
    Mozilla/5.0 (X11; Linux x86_64; rv:57.0) Gecko/20100101 Firefox/57.0

    apt install libpcap0.8-dev python-pcapy

  9. Firefox 51.0 Firefox 51.0 Windows 8 x64 Edition Windows 8 x64 Edition
    Mozilla/5.0 (Windows NT 6.2; WOW64; rv:51.0) Gecko/20100101 Firefox/51.0

    funziona tutto! unico inconveniente (ma è colpa mia) è che ora mi ritroverò forse con qualche problemino di connessione in determinate situazioni. immagino a seguito di un'errata configurazione durante l'installazione di uno di questi pacchetti. ricordo la notifica uscita ad avvisarmi del pericolo. mi è stato chiesto di rispondere affermativamente o negativamente e – a quanto parte – ho sbagliato risposta 🙂

    grazie comunque! resto in attesa della prossima guida 😉

Lascia un commento

Il tuo indirizzo email non sarà pubblicato. I campi obbligatori sono contrassegnati *